恩山无线论坛

 找回密码
 立即注册

QQ登录

只需一步,快速开始

搜索
当贝投影
查看: 522|回复: 2

[AX3600] Boos4721的固件编译,qca-nss-clients编译失败

[复制链接]
发表于 2022-5-19 13:54 | 显示全部楼层 |阅读模式
make[4]: Entering directory '/home/yale/Boos4721/build_dir/target-aarch64_cortex-a53_musl/linux-ipq807x_generic/linux-5.15.40'
  CC [M]  /home/yale/Boos4721/build_dir/target-aarch64_cortex-a53_musl/linux-ipq807x_generic/qca-nss-clients-2022-04-23-7e86daa6/bridge/nss_bridge_mgr.o
  LD [M]  /home/yale/Boos4721/build_dir/target-aarch64_cortex-a53_musl/linux-ipq807x_generic/qca-nss-clients-2022-04-23-7e86daa6/bridge/qca-nss-bridge-mgr.o
  CC [M]  /home/yale/Boos4721/build_dir/target-aarch64_cortex-a53_musl/linux-ipq807x_generic/qca-nss-clients-2022-04-23-7e86daa6/vlan/nss_vlan_mgr.o
  LD [M]  /home/yale/Boos4721/build_dir/target-aarch64_cortex-a53_musl/linux-ipq807x_generic/qca-nss-clients-2022-04-23-7e86daa6/vlan/qca-nss-vlan.o
  MODPOST /home/yale/Boos4721/build_dir/target-aarch64_cortex-a53_musl/linux-ipq807x_generic/qca-nss-clients-2022-04-23-7e86daa6/Module.symvers
ERROR: modpost: "nss_unregister_pppoe_session_if" [/home/yale/Boos4721/build_dir/target-aarch64_cortex-a53_musl/linux-ipq807x_generic/qca-nss-clients-2022-04-23-7e86daa6/pppoe/qca-nss-pppoe.ko] undefined!
ERROR: modpost: "nss_pppoe_get_context" [/home/yale/Boos4721/build_dir/target-aarch64_cortex-a53_musl/linux-ipq807x_generic/qca-nss-clients-2022-04-23-7e86daa6/pppoe/qca-nss-pppoe.ko] undefined!
ERROR: modpost: "nss_pppoe_msg_init" [/home/yale/Boos4721/build_dir/target-aarch64_cortex-a53_musl/linux-ipq807x_generic/qca-nss-clients-2022-04-23-7e86daa6/pppoe/qca-nss-pppoe.ko] undefined!
ERROR: modpost: "nss_pppoe_tx_msg_sync" [/home/yale/Boos4721/build_dir/target-aarch64_cortex-a53_musl/linux-ipq807x_generic/qca-nss-clients-2022-04-23-7e86daa6/pppoe/qca-nss-pppoe.ko] undefined!
ERROR: modpost: "nss_register_pppoe_session_if" [/home/yale/Boos4721/build_dir/target-aarch64_cortex-a53_musl/linux-ipq807x_generic/qca-nss-clients-2022-04-23-7e86daa6/pppoe/qca-nss-pppoe.ko] undefined!
ERROR: modpost: "nss_vlan_tx_vsi_detach_msg" [/home/yale/Boos4721/build_dir/target-aarch64_cortex-a53_musl/linux-ipq807x_generic/qca-nss-clients-2022-04-23-7e86daa6/vlan/qca-nss-vlan.ko] undefined!
ERROR: modpost: "nss_vlan_tx_add_tag_msg" [/home/yale/Boos4721/build_dir/target-aarch64_cortex-a53_musl/linux-ipq807x_generic/qca-nss-clients-2022-04-23-7e86daa6/vlan/qca-nss-vlan.ko] undefined!
ERROR: modpost: "nss_vlan_tx_set_mac_addr_msg" [/home/yale/Boos4721/build_dir/target-aarch64_cortex-a53_musl/linux-ipq807x_generic/qca-nss-clients-2022-04-23-7e86daa6/vlan/qca-nss-vlan.ko] undefined!
ERROR: modpost: "nss_unregister_vlan_if" [/home/yale/Boos4721/build_dir/target-aarch64_cortex-a53_musl/linux-ipq807x_generic/qca-nss-clients-2022-04-23-7e86daa6/vlan/qca-nss-vlan.ko] undefined!
ERROR: modpost: "nss_vlan_tx_vsi_attach_msg" [/home/yale/Boos4721/build_dir/target-aarch64_cortex-a53_musl/linux-ipq807x_generic/qca-nss-clients-2022-04-23-7e86daa6/vlan/qca-nss-vlan.ko] undefined!
WARNING: modpost: suppressed 11 unresolved symbol warnings because there were too many)
make[5]: *** [scripts/Makefile.modpost:134: /home/yale/Boos4721/build_dir/target-aarch64_cortex-a53_musl/linux-ipq807x_generic/qca-nss-clients-2022-04-23-7e86daa6/Module.symvers] Error 1
make[5]: *** Deleting file '/home/yale/Boos4721/build_dir/target-aarch64_cortex-a53_musl/linux-ipq807x_generic/qca-nss-clients-2022-04-23-7e86daa6/Module.symvers'
make[4]: *** [Makefile:1783: modules] Error 2
make[4]: Leaving directory '/home/yale/Boos4721/build_dir/target-aarch64_cortex-a53_musl/linux-ipq807x_generic/linux-5.15.40'
make[3]: *** [Makefile:114: /home/yale/Boos4721/build_dir/target-aarch64_cortex-a53_musl/linux-ipq807x_generic/qca-nss-clients-2022-04-23-7e86daa6/.built] Error 2
make[3]: Leaving directory '/home/yale/Boos4721/package/qca/nss/qca-nss-clients'
time: package/qca/nss/qca-nss-clients/compile#3.19#0.40#3.57
    ERROR: package/qca/nss/qca-nss-clients failed to build.
make[2]: *** [package/Makefile:116: package/qca/nss/qca-nss-clients/compile] Error 1
make[2]: Leaving directory '/home/yale/Boos4721'
make[1]: *** [package/Makefile:110: /home/yale/Boos4721/staging_dir/target-aarch64_cortex-a53_musl/stamp/.package_compile] Error 2
make[1]: Leaving directory '/home/yale/Boos4721'
make: *** [/home/yale/Boos4721/include/toplevel.mk:230:world] 错误 2


我的恩山、我的无线 The best wifi forum is right here.
发表于 2022-5-20 17:49 | 显示全部楼层
github上开个discussion讨论
我的恩山、我的无线 The best wifi forum is right here.
发表于 2022-5-20 17:59 | 显示全部楼层
拉库不全,不知道怎么解决
实在解决不了,删掉重来
刚用Boos4721的库编了个AX3600的固件
提示一下,没扩容的话,固件必须要小于29M,否则无法保存设置
我的恩山、我的无线 The best wifi forum is right here.
您需要登录后才可以回帖 登录 | 立即注册

本版积分规则

QQ|手机版|小黑屋|Archiver|恩山无线论坛(常州市恩山计算机开发有限公司版权所有) ( 苏ICP备05084872号 )|网站地图

GMT+8, 2022-6-27 11:06

Powered by Discuz! X3.4

Copyright © 2001-2021, Tencent Cloud.

快速回复 返回顶部 返回列表