找回密码
 立即注册

QQ登录

只需一步,快速开始

搜索
广告投放联系QQ68610888
查看: 2382|回复: 13

编译N1固件出错,路过的大神帮忙看看

[复制链接]
make[3]: Leaving directory '/home/openwrt/openwrt/lede/feeds/packages/libs/c-ares'
time: package/feeds/packages/c-ares/compile#0.51#0.51#1.10
make[3]: Entering directory '/home/openwrt/openwrt/lede/feeds/small/违禁软件-rust'
mkdir -p /home/openwrt/openwrt/lede/dl
SHELL= flock /home/openwrt/openwrt/lede/tmp/.mbedtls-2.16.11.tar.gz.flock -c '          /home/openwrt/openwrt/lede/scripts/download.pl "/home/openwrt/openwrt/lede/dl" "mbedtls-2.16.11.tar.gz" "c18e7e9abf95e69e425260493720470021384a1728417042060a35d0b7b18b41" "" "https://codeload.github.com/ARMmbed/mbedtls/tar.gz/v2.16.11?"    '
rm -f /home/openwrt/openwrt/lede/build_dir/target-aarch64_cortex-a53_musl/mbedtls-2.16.11/.built
touch /home/openwrt/openwrt/lede/build_dir/target-aarch64_cortex-a53_musl/mbedtls-2.16.11/.built_check
MAKEFLAGS="--jobserver-auth=3,4" /home/openwrt/openwrt/lede/staging_dir/host/bin/ninja   -C /home/openwrt/openwrt/lede/build_dir/target-aarch64_cortex-a53_musl/mbedtls-2.16.11
ninja: Entering directory `/home/openwrt/openwrt/lede/build_dir/target-aarch64_cortex-a53_musl/mbedtls-2.16.11'
[0/246] Building C object library/CMakeFiles/mbedcrypto.dir/armv8ce_aes.c.omkdir -p /home/openwrt/openwrt/lede/dl
SHELL= flock /home/openwrt/openwrt/lede/tmp/.违禁软件-v1.12.4.aarch64-unknown-linux-musl.tar.xz.flock -c '          /home/openwrt/openwrt/lede/scripts/download.pl "/home/openwrt/openwrt/lede/dl" "违禁软件-v1.12.4.aarch64-unknown-linux-musl.tar.xz" "skip" "" "https://github.com/违禁软件/违禁软件-rust/releases/download/v1.12.4/"    '
mkdir -p /home/openwrt/openwrt/lede/staging_dir/target-aarch64_cortex-a53_musl/root-armvirt/stamp
SHELL= flock /home/openwrt/openwrt/lede/tmp/.root-copy.flock -c 'cp -fpR /home/openwrt/openwrt/lede/build_dir/target-aarch64_cortex-a53_musl/违禁软件-rust-1.12.4/.pkgdir/违禁软件-rust-sslocal/. /home/openwrt/openwrt/lede/staging_dir/target-aarch64_cortex-a53_musl/root-armvirt/'
[1/246] Building C object library/CMakeFiles/mbedcrypto.dir/armv8ce_aes.c.o
FAILED: library/CMakeFiles/mbedcrypto.dir/armv8ce_aes.c.o
/home/openwrt/openwrt/lede/staging_dir/toolchain-aarch64_cortex-a53_gcc-8.4.0_musl/bin/aarch64-openwrt-linux-musl-gcc -Dmbedcrypto_EXPORTS -I/home/openwrt/openwrt/lede/build_dir/target-aarch64_cortex-a53_musl/mbedtls-2.16.11/include -pipe -mcpu=cortex-a53 -fno-caller-saves -fno-plt -fhonour-copts -Wno-error=unused-but-set-variable -Wno-error=unused-result -fmacro-prefix-map=/home/openwrt/openwrt/lede/build_dir/target-aarch64_cortex-a53_musl/mbedtls-2.16.11=mbedtls-2.16.11 -Wformat -Werror=format-security -fstack-protector -D_FORTIFY_SOURCE=1 -Wl,-z,now -Wl,-z,relro -ffunction-sections -fdata-sections -Wall -Wextra -W -Wdeclaration-after-statement -Wwrite-strings -Wlogical-op -Wshadow -Wmissing-declarations -Wmissing-prototypes -O2 -fPIC -MD -MT library/CMakeFiles/mbedcrypto.dir/armv8ce_aes.c.o -MF library/CMakeFiles/mbedcrypto.dir/armv8ce_aes.c.o.d -o library/CMakeFiles/mbedcrypto.dir/armv8ce_aes.c.o -c /home/openwrt/openwrt/lede/build_dir/target-aarch64_cortex-a53_musl/mbedtls-2.16.11/library/armv8ce_aes.c
In file included from /home/openwrt/openwrt/lede/build_dir/target-aarch64_cortex-a53_musl/mbedtls-2.16.11/library/armv8ce_aes.c:30:
/home/openwrt/openwrt/lede/build_dir/target-aarch64_cortex-a53_musl/mbedtls-2.16.11/library/armv8ce_aes.c: In function 'mbedtls_armv8ce_aes_crypt_ecb':
/home/openwrt/openwrt/lede/staging_dir/toolchain-aarch64_cortex-a53_gcc-8.4.0_musl/lib/gcc/aarch64-openwrt-linux-musl/8.4.0/include/arm_neon.h:12440:1: error: inlining failed in call to always_inline 'vaesmcq_u8': target specific option mismatch
vaesmcq_u8 (uint8x16_t data)
^~~~~~~~~~
/home/openwrt/openwrt/lede/build_dir/target-aarch64_cortex-a53_musl/mbedtls-2.16.11/library/armv8ce_aes.c:62:17: note: called from here
             x = vaesmcq_u8( x );
                 ^~~~~~~~~~~~~~~
In file included from /home/openwrt/openwrt/lede/build_dir/target-aarch64_cortex-a53_musl/mbedtls-2.16.11/library/armv8ce_aes.c:30:
/home/openwrt/openwrt/lede/staging_dir/toolchain-aarch64_cortex-a53_gcc-8.4.0_musl/lib/gcc/aarch64-openwrt-linux-musl/8.4.0/include/arm_neon.h:12426:1: error: inlining failed in call to always_inline 'vaeseq_u8': target specific option mismatch
vaeseq_u8 (uint8x16_t data, uint8x16_t key)
^~~~~~~~~
/home/openwrt/openwrt/lede/build_dir/target-aarch64_cortex-a53_musl/mbedtls-2.16.11/library/armv8ce_aes.c:61:17: note: called from here
             x = vaeseq_u8( x, k );
                 ^~~~~~~~~~~~~~~~~
In file included from /home/openwrt/openwrt/lede/build_dir/target-aarch64_cortex-a53_musl/mbedtls-2.16.11/library/armv8ce_aes.c:30:
/home/openwrt/openwrt/lede/staging_dir/toolchain-aarch64_cortex-a53_gcc-8.4.0_musl/lib/gcc/aarch64-openwrt-linux-musl/8.4.0/include/arm_neon.h:12440:1: error: inlining failed in call to always_inline 'vaesmcq_u8': target specific option mismatch
vaesmcq_u8 (uint8x16_t data)
^~~~~~~~~~
/home/openwrt/openwrt/lede/build_dir/target-aarch64_cortex-a53_musl/mbedtls-2.16.11/library/armv8ce_aes.c:62:17: note: called from here
             x = vaesmcq_u8( x );
                 ^~~~~~~~~~~~~~~
In file included from /home/openwrt/openwrt/lede/build_dir/target-aarch64_cortex-a53_musl/mbedtls-2.16.11/library/armv8ce_aes.c:30:
/home/openwrt/openwrt/lede/staging_dir/toolchain-aarch64_cortex-a53_gcc-8.4.0_musl/lib/gcc/aarch64-openwrt-linux-musl/8.4.0/include/arm_neon.h:12426:1: error: inlining failed in call to always_inline 'vaeseq_u8': target specific option mismatch
vaeseq_u8 (uint8x16_t data, uint8x16_t key)
^~~~~~~~~
/home/openwrt/openwrt/lede/build_dir/target-aarch64_cortex-a53_musl/mbedtls-2.16.11/library/armv8ce_aes.c:61:17: note: called from here
             x = vaeseq_u8( x, k );
                 ^~~~~~~~~~~~~~~~~
In file included from /home/openwrt/openwrt/lede/build_dir/target-aarch64_cortex-a53_musl/mbedtls-2.16.11/library/armv8ce_aes.c:30:
/home/openwrt/openwrt/lede/staging_dir/toolchain-aarch64_cortex-a53_gcc-8.4.0_musl/lib/gcc/aarch64-openwrt-linux-musl/8.4.0/include/arm_neon.h:12426:1: error: inlining failed in call to always_inline 'vaeseq_u8': target specific option mismatch
vaeseq_u8 (uint8x16_t data, uint8x16_t key)
^~~~~~~~~
/home/openwrt/openwrt/lede/build_dir/target-aarch64_cortex-a53_musl/mbedtls-2.16.11/library/armv8ce_aes.c:66:13: note: called from here
         x = vaeseq_u8( x, k );
             ^~~~~~~~~~~~~~~~~
In file included from /home/openwrt/openwrt/lede/build_dir/target-aarch64_cortex-a53_musl/mbedtls-2.16.11/library/armv8ce_aes.c:30:
/home/openwrt/openwrt/lede/staging_dir/toolchain-aarch64_cortex-a53_gcc-8.4.0_musl/lib/gcc/aarch64-openwrt-linux-musl/8.4.0/include/arm_neon.h:12426:1: error: inlining failed in call to always_inline 'vaeseq_u8': target specific option mismatch
vaeseq_u8 (uint8x16_t data, uint8x16_t key)
^~~~~~~~~
/home/openwrt/openwrt/lede/build_dir/target-aarch64_cortex-a53_musl/mbedtls-2.16.11/library/armv8ce_aes.c:66:13: note: called from here
         x = vaeseq_u8( x, k );
             ^~~~~~~~~~~~~~~~~
In file included from /home/openwrt/openwrt/lede/build_dir/target-aarch64_cortex-a53_musl/mbedtls-2.16.11/library/armv8ce_aes.c:30:
/home/openwrt/openwrt/lede/staging_dir/toolchain-aarch64_cortex-a53_gcc-8.4.0_musl/lib/gcc/aarch64-openwrt-linux-musl/8.4.0/include/arm_neon.h:12447:1: error: inlining failed in call to always_inline 'vaesimcq_u8': target specific option mismatch
vaesimcq_u8 (uint8x16_t data)
^~~~~~~~~~~
/home/openwrt/openwrt/lede/build_dir/target-aarch64_cortex-a53_musl/mbedtls-2.16.11/library/armv8ce_aes.c:75:17: note: called from here
             x = vaesimcq_u8( x );
                 ^~~~~~~~~~~~~~~~
In file included from /home/openwrt/openwrt/lede/build_dir/target-aarch64_cortex-a53_musl/mbedtls-2.16.11/library/armv8ce_aes.c:30:
/home/openwrt/openwrt/lede/staging_dir/toolchain-aarch64_cortex-a53_gcc-8.4.0_musl/lib/gcc/aarch64-openwrt-linux-musl/8.4.0/include/arm_neon.h:12433:1: error: inlining failed in call to always_inline 'vaesdq_u8': target specific option mismatch
vaesdq_u8 (uint8x16_t data, uint8x16_t key)
^~~~~~~~~
/home/openwrt/openwrt/lede/build_dir/target-aarch64_cortex-a53_musl/mbedtls-2.16.11/library/armv8ce_aes.c:74:17: note: called from here
             x = vaesdq_u8( x, k );
                 ^~~~~~~~~~~~~~~~~
In file included from /home/openwrt/openwrt/lede/build_dir/target-aarch64_cortex-a53_musl/mbedtls-2.16.11/library/armv8ce_aes.c:30:
/home/openwrt/openwrt/lede/staging_dir/toolchain-aarch64_cortex-a53_gcc-8.4.0_musl/lib/gcc/aarch64-openwrt-linux-musl/8.4.0/include/arm_neon.h:12447:1: error: inlining failed in call to always_inline 'vaesimcq_u8': target specific option mismatch
vaesimcq_u8 (uint8x16_t data)
^~~~~~~~~~~
/home/openwrt/openwrt/lede/build_dir/target-aarch64_cortex-a53_musl/mbedtls-2.16.11/library/armv8ce_aes.c:75:17: note: called from here
             x = vaesimcq_u8( x );
                 ^~~~~~~~~~~~~~~~
In file included from /home/openwrt/openwrt/lede/build_dir/target-aarch64_cortex-a53_musl/mbedtls-2.16.11/library/armv8ce_aes.c:30:
/home/openwrt/openwrt/lede/staging_dir/toolchain-aarch64_cortex-a53_gcc-8.4.0_musl/lib/gcc/aarch64-openwrt-linux-musl/8.4.0/include/arm_neon.h:12433:1: error: inlining failed in call to always_inline 'vaesdq_u8': target specific option mismatch
vaesdq_u8 (uint8x16_t data, uint8x16_t key)
^~~~~~~~~
/home/openwrt/openwrt/lede/build_dir/target-aarch64_cortex-a53_musl/mbedtls-2.16.11/library/armv8ce_aes.c:74:17: note: called from here
             x = vaesdq_u8( x, k );
                 ^~~~~~~~~~~~~~~~~
In file included from /home/openwrt/openwrt/lede/build_dir/target-aarch64_cortex-a53_musl/mbedtls-2.16.11/library/armv8ce_aes.c:30:
/home/openwrt/openwrt/lede/staging_dir/toolchain-aarch64_cortex-a53_gcc-8.4.0_musl/lib/gcc/aarch64-openwrt-linux-musl/8.4.0/include/arm_neon.h:12433:1: error: inlining failed in call to always_inline 'vaesdq_u8': target specific option mismatch
vaesdq_u8 (uint8x16_t data, uint8x16_t key)
^~~~~~~~~
/home/openwrt/openwrt/lede/build_dir/target-aarch64_cortex-a53_musl/mbedtls-2.16.11/library/armv8ce_aes.c:79:13: note: called from here
         x = vaesdq_u8( x, k );
             ^~~~~~~~~~~~~~~~~
In file included from /home/openwrt/openwrt/lede/build_dir/target-aarch64_cortex-a53_musl/mbedtls-2.16.11/library/armv8ce_aes.c:30:
/home/openwrt/openwrt/lede/staging_dir/toolchain-aarch64_cortex-a53_gcc-8.4.0_musl/lib/gcc/aarch64-openwrt-linux-musl/8.4.0/include/arm_neon.h:12433:1: error: inlining failed in call to always_inline 'vaesdq_u8': target specific option mismatch
vaesdq_u8 (uint8x16_t data, uint8x16_t key)
^~~~~~~~~
/home/openwrt/openwrt/lede/build_dir/target-aarch64_cortex-a53_musl/mbedtls-2.16.11/library/armv8ce_aes.c:79:13: note: called from here
         x = vaesdq_u8( x, k );
             ^~~~~~~~~~~~~~~~~
ninja: build stopped: subcommand failed.
make[3]: *** [Makefile:176: /home/openwrt/openwrt/lede/build_dir/target-aarch64_cortex-a53_musl/mbedtls-2.16.11/.built] Error 1
make[3]: Leaving directory '/home/openwrt/openwrt/lede/package/libs/mbedtls'
time: package/libs/mbedtls/compile#1.19#0.73#1.98
    ERROR: package/libs/mbedtls failed to build.
make[2]: *** [package/Makefile:116: package/libs/mbedtls/compile] Error 1
make[2]: *** Waiting for unfinished jobs....
touch /home/openwrt/openwrt/lede/staging_dir/target-aarch64_cortex-a53_musl/root-armvirt/stamp/.违禁软件-rust-sslocal_installed
echo "违禁软件-rust-sslocal" >> /home/openwrt/openwrt/lede/staging_dir/target-aarch64_cortex-a53_musl/pkginfo/违禁软件-rust.default.install
mkdir -p /home/openwrt/openwrt/lede/staging_dir/target-aarch64_cortex-a53_musl/root-armvirt/stamp
SHELL= flock /home/openwrt/openwrt/lede/tmp/.root-copy.flock -c 'cp -fpR /home/openwrt/openwrt/lede/build_dir/target-aarch64_cortex-a53_musl/违禁软件-rust-1.12.4/.pkgdir/违禁软件-rust-ssserver/. /home/openwrt/openwrt/lede/staging_dir/target-aarch64_cortex-a53_musl/root-armvirt/'
touch /home/openwrt/openwrt/lede/staging_dir/target-aarch64_cortex-a53_musl/root-armvirt/stamp/.违禁软件-rust-ssserver_installed
echo "违禁软件-rust-ssserver" >> /home/openwrt/openwrt/lede/staging_dir/target-aarch64_cortex-a53_musl/pkginfo/违禁软件-rust.default.install
make[3]: Leaving directory '/home/openwrt/openwrt/lede/feeds/small/违禁软件-rust'
time: package/feeds/small/违禁软件-rust/compile#0.50#0.66#1.41
make[2]: Leaving directory '/home/openwrt/openwrt/lede'
make[1]: *** [package/Makefile:110: /home/openwrt/openwrt/lede/staging_dir/target-aarch64_cortex-a53_musl/stamp/.package_compile] Error 2
make[1]: Leaving directory '/home/openwrt/openwrt/lede'
make: *** [/home/openwrt/openwrt/lede/include/toplevel.mk:230:world] 错误 2

回帖奖励 +2 币恩山币

违禁软件-rust
package/Makefile:110
两个错误,先处理违禁软件。
回复

使用道具 举报

 楼主| | 显示全部楼层
zhao789110 发表于 2021-12-10 09:44
违禁软件-rust
package/Makefile:110
两个错误,先处理违禁软件。

make[3]: Leaving directory '/home/openwrt/openwrt/lede/feeds/packages/libs/c-ares'
time: package/feeds/packages/c-ares/compile#0.50#0.53#0.92
make[3]: Entering directory '/home/openwrt/openwrt/lede/package/libs/mbedtls'
mkdir -p /home/openwrt/openwrt/lede/dl
SHELL= flock /home/openwrt/openwrt/lede/tmp/.mbedtls-2.16.11.tar.gz.flock -c '          /home/openwrt/openwrt/lede/scripts/download.pl "/home/openwrt/openwrt/lede/dl" "mbedtls-2.16.11.tar.gz" "c18e7e9abf95e69e425260493720470021384a1728417042060a35d0b7b18b41" "" "https://codeload.github.com/ARMmbed/mbedtls/tar.gz/v2.16.11?"    '
rm -f /home/openwrt/openwrt/lede/build_dir/target-aarch64_cortex-a53_musl/mbedtls-2.16.11/.built
touch /home/openwrt/openwrt/lede/build_dir/target-aarch64_cortex-a53_musl/mbedtls-2.16.11/.built_check
MAKEFLAGS="" /home/openwrt/openwrt/lede/staging_dir/host/bin/ninja  -j1 -C /home/openwrt/openwrt/lede/build_dir/target-aarch64_cortex-a53_musl/mbedtls-2.16.11
ninja: Entering directory `/home/openwrt/openwrt/lede/build_dir/target-aarch64_cortex-a53_musl/mbedtls-2.16.11'
[1/246] Building C object library/CMakeFiles/mbedcrypto.dir/armv8ce_aes.c.o
FAILED: library/CMakeFiles/mbedcrypto.dir/armv8ce_aes.c.o
/home/openwrt/openwrt/lede/staging_dir/toolchain-aarch64_cortex-a53_gcc-8.4.0_musl/bin/aarch64-openwrt-linux-musl-gcc -Dmbedcrypto_EXPORTS -I/home/openwrt/openwrt/lede/build_dir/target-aarch64_cortex-a53_musl/mbedtls-2.16.11/include -pipe -mcpu=cortex-a53 -fno-caller-saves -fno-plt -fhonour-copts -Wno-error=unused-but-set-variable -Wno-error=unused-result -fmacro-prefix-map=/home/openwrt/openwrt/lede/build_dir/target-aarch64_cortex-a53_musl/mbedtls-2.16.11=mbedtls-2.16.11 -Wformat -Werror=format-security -fstack-protector -D_FORTIFY_SOURCE=1 -Wl,-z,now -Wl,-z,relro -ffunction-sections -fdata-sections -Wall -Wextra -W -Wdeclaration-after-statement -Wwrite-strings -Wlogical-op -Wshadow -Wmissing-declarations -Wmissing-prototypes -O2 -fPIC -MD -MT library/CMakeFiles/mbedcrypto.dir/armv8ce_aes.c.o -MF library/CMakeFiles/mbedcrypto.dir/armv8ce_aes.c.o.d -o library/CMakeFiles/mbedcrypto.dir/armv8ce_aes.c.o -c /home/openwrt/openwrt/lede/build_dir/target-aarch64_cortex-a53_musl/mbedtls-2.16.11/library/armv8ce_aes.c
In file included from /home/openwrt/openwrt/lede/build_dir/target-aarch64_cortex-a53_musl/mbedtls-2.16.11/library/armv8ce_aes.c:30:
/home/openwrt/openwrt/lede/build_dir/target-aarch64_cortex-a53_musl/mbedtls-2.16.11/library/armv8ce_aes.c: In function 'mbedtls_armv8ce_aes_crypt_ecb':
/home/openwrt/openwrt/lede/staging_dir/toolchain-aarch64_cortex-a53_gcc-8.4.0_musl/lib/gcc/aarch64-openwrt-linux-musl/8.4.0/include/arm_neon.h:12440:1: error: inlining failed in call to always_inline 'vaesmcq_u8': target specific option mismatch
vaesmcq_u8 (uint8x16_t data)
^~~~~~~~~~
/home/openwrt/openwrt/lede/build_dir/target-aarch64_cortex-a53_musl/mbedtls-2.16.11/library/armv8ce_aes.c:62:17: note: called from here
             x = vaesmcq_u8( x );
                 ^~~~~~~~~~~~~~~
In file included from /home/openwrt/openwrt/lede/build_dir/target-aarch64_cortex-a53_musl/mbedtls-2.16.11/library/armv8ce_aes.c:30:
/home/openwrt/openwrt/lede/staging_dir/toolchain-aarch64_cortex-a53_gcc-8.4.0_musl/lib/gcc/aarch64-openwrt-linux-musl/8.4.0/include/arm_neon.h:12426:1: error: inlining failed in call to always_inline 'vaeseq_u8': target specific option mismatch
vaeseq_u8 (uint8x16_t data, uint8x16_t key)
^~~~~~~~~
/home/openwrt/openwrt/lede/build_dir/target-aarch64_cortex-a53_musl/mbedtls-2.16.11/library/armv8ce_aes.c:61:17: note: called from here
             x = vaeseq_u8( x, k );
                 ^~~~~~~~~~~~~~~~~
In file included from /home/openwrt/openwrt/lede/build_dir/target-aarch64_cortex-a53_musl/mbedtls-2.16.11/library/armv8ce_aes.c:30:
/home/openwrt/openwrt/lede/staging_dir/toolchain-aarch64_cortex-a53_gcc-8.4.0_musl/lib/gcc/aarch64-openwrt-linux-musl/8.4.0/include/arm_neon.h:12440:1: error: inlining failed in call to always_inline 'vaesmcq_u8': target specific option mismatch
vaesmcq_u8 (uint8x16_t data)
^~~~~~~~~~
/home/openwrt/openwrt/lede/build_dir/target-aarch64_cortex-a53_musl/mbedtls-2.16.11/library/armv8ce_aes.c:62:17: note: called from here
             x = vaesmcq_u8( x );
                 ^~~~~~~~~~~~~~~
In file included from /home/openwrt/openwrt/lede/build_dir/target-aarch64_cortex-a53_musl/mbedtls-2.16.11/library/armv8ce_aes.c:30:
/home/openwrt/openwrt/lede/staging_dir/toolchain-aarch64_cortex-a53_gcc-8.4.0_musl/lib/gcc/aarch64-openwrt-linux-musl/8.4.0/include/arm_neon.h:12426:1: error: inlining failed in call to always_inline 'vaeseq_u8': target specific option mismatch
vaeseq_u8 (uint8x16_t data, uint8x16_t key)
^~~~~~~~~
/home/openwrt/openwrt/lede/build_dir/target-aarch64_cortex-a53_musl/mbedtls-2.16.11/library/armv8ce_aes.c:61:17: note: called from here
             x = vaeseq_u8( x, k );
                 ^~~~~~~~~~~~~~~~~
In file included from /home/openwrt/openwrt/lede/build_dir/target-aarch64_cortex-a53_musl/mbedtls-2.16.11/library/armv8ce_aes.c:30:
/home/openwrt/openwrt/lede/staging_dir/toolchain-aarch64_cortex-a53_gcc-8.4.0_musl/lib/gcc/aarch64-openwrt-linux-musl/8.4.0/include/arm_neon.h:12426:1: error: inlining failed in call to always_inline 'vaeseq_u8': target specific option mismatch
vaeseq_u8 (uint8x16_t data, uint8x16_t key)
^~~~~~~~~
/home/openwrt/openwrt/lede/build_dir/target-aarch64_cortex-a53_musl/mbedtls-2.16.11/library/armv8ce_aes.c:66:13: note: called from here
         x = vaeseq_u8( x, k );
             ^~~~~~~~~~~~~~~~~
In file included from /home/openwrt/openwrt/lede/build_dir/target-aarch64_cortex-a53_musl/mbedtls-2.16.11/library/armv8ce_aes.c:30:
/home/openwrt/openwrt/lede/staging_dir/toolchain-aarch64_cortex-a53_gcc-8.4.0_musl/lib/gcc/aarch64-openwrt-linux-musl/8.4.0/include/arm_neon.h:12426:1: error: inlining failed in call to always_inline 'vaeseq_u8': target specific option mismatch
vaeseq_u8 (uint8x16_t data, uint8x16_t key)
^~~~~~~~~
/home/openwrt/openwrt/lede/build_dir/target-aarch64_cortex-a53_musl/mbedtls-2.16.11/library/armv8ce_aes.c:66:13: note: called from here
         x = vaeseq_u8( x, k );
             ^~~~~~~~~~~~~~~~~
In file included from /home/openwrt/openwrt/lede/build_dir/target-aarch64_cortex-a53_musl/mbedtls-2.16.11/library/armv8ce_aes.c:30:
/home/openwrt/openwrt/lede/staging_dir/toolchain-aarch64_cortex-a53_gcc-8.4.0_musl/lib/gcc/aarch64-openwrt-linux-musl/8.4.0/include/arm_neon.h:12447:1: error: inlining failed in call to always_inline 'vaesimcq_u8': target specific option mismatch
vaesimcq_u8 (uint8x16_t data)
^~~~~~~~~~~
/home/openwrt/openwrt/lede/build_dir/target-aarch64_cortex-a53_musl/mbedtls-2.16.11/library/armv8ce_aes.c:75:17: note: called from here
             x = vaesimcq_u8( x );
                 ^~~~~~~~~~~~~~~~
In file included from /home/openwrt/openwrt/lede/build_dir/target-aarch64_cortex-a53_musl/mbedtls-2.16.11/library/armv8ce_aes.c:30:
/home/openwrt/openwrt/lede/staging_dir/toolchain-aarch64_cortex-a53_gcc-8.4.0_musl/lib/gcc/aarch64-openwrt-linux-musl/8.4.0/include/arm_neon.h:12433:1: error: inlining failed in call to always_inline 'vaesdq_u8': target specific option mismatch
vaesdq_u8 (uint8x16_t data, uint8x16_t key)
^~~~~~~~~
/home/openwrt/openwrt/lede/build_dir/target-aarch64_cortex-a53_musl/mbedtls-2.16.11/library/armv8ce_aes.c:74:17: note: called from here
             x = vaesdq_u8( x, k );
                 ^~~~~~~~~~~~~~~~~
In file included from /home/openwrt/openwrt/lede/build_dir/target-aarch64_cortex-a53_musl/mbedtls-2.16.11/library/armv8ce_aes.c:30:
/home/openwrt/openwrt/lede/staging_dir/toolchain-aarch64_cortex-a53_gcc-8.4.0_musl/lib/gcc/aarch64-openwrt-linux-musl/8.4.0/include/arm_neon.h:12447:1: error: inlining failed in call to always_inline 'vaesimcq_u8': target specific option mismatch
vaesimcq_u8 (uint8x16_t data)
^~~~~~~~~~~
/home/openwrt/openwrt/lede/build_dir/target-aarch64_cortex-a53_musl/mbedtls-2.16.11/library/armv8ce_aes.c:75:17: note: called from here
             x = vaesimcq_u8( x );
                 ^~~~~~~~~~~~~~~~
In file included from /home/openwrt/openwrt/lede/build_dir/target-aarch64_cortex-a53_musl/mbedtls-2.16.11/library/armv8ce_aes.c:30:
/home/openwrt/openwrt/lede/staging_dir/toolchain-aarch64_cortex-a53_gcc-8.4.0_musl/lib/gcc/aarch64-openwrt-linux-musl/8.4.0/include/arm_neon.h:12433:1: error: inlining failed in call to always_inline 'vaesdq_u8': target specific option mismatch
vaesdq_u8 (uint8x16_t data, uint8x16_t key)
^~~~~~~~~
/home/openwrt/openwrt/lede/build_dir/target-aarch64_cortex-a53_musl/mbedtls-2.16.11/library/armv8ce_aes.c:74:17: note: called from here
             x = vaesdq_u8( x, k );
                 ^~~~~~~~~~~~~~~~~
In file included from /home/openwrt/openwrt/lede/build_dir/target-aarch64_cortex-a53_musl/mbedtls-2.16.11/library/armv8ce_aes.c:30:
/home/openwrt/openwrt/lede/staging_dir/toolchain-aarch64_cortex-a53_gcc-8.4.0_musl/lib/gcc/aarch64-openwrt-linux-musl/8.4.0/include/arm_neon.h:12433:1: error: inlining failed in call to always_inline 'vaesdq_u8': target specific option mismatch
vaesdq_u8 (uint8x16_t data, uint8x16_t key)
^~~~~~~~~
/home/openwrt/openwrt/lede/build_dir/target-aarch64_cortex-a53_musl/mbedtls-2.16.11/library/armv8ce_aes.c:79:13: note: called from here
         x = vaesdq_u8( x, k );
             ^~~~~~~~~~~~~~~~~
In file included from /home/openwrt/openwrt/lede/build_dir/target-aarch64_cortex-a53_musl/mbedtls-2.16.11/library/armv8ce_aes.c:30:
/home/openwrt/openwrt/lede/staging_dir/toolchain-aarch64_cortex-a53_gcc-8.4.0_musl/lib/gcc/aarch64-openwrt-linux-musl/8.4.0/include/arm_neon.h:12433:1: error: inlining failed in call to always_inline 'vaesdq_u8': target specific option mismatch
vaesdq_u8 (uint8x16_t data, uint8x16_t key)
^~~~~~~~~
/home/openwrt/openwrt/lede/build_dir/target-aarch64_cortex-a53_musl/mbedtls-2.16.11/library/armv8ce_aes.c:79:13: note: called from here
         x = vaesdq_u8( x, k );
             ^~~~~~~~~~~~~~~~~
ninja: build stopped: subcommand failed.
make[3]: *** [Makefile:176: /home/openwrt/openwrt/lede/build_dir/target-aarch64_cortex-a53_musl/mbedtls-2.16.11/.built] Error 1
make[3]: Leaving directory '/home/openwrt/openwrt/lede/package/libs/mbedtls'
time: package/libs/mbedtls/compile#1.04#0.62#1.52
    ERROR: package/libs/mbedtls failed to build.
make[2]: *** [package/Makefile:116: package/libs/mbedtls/compile] Error 1
make[2]: Leaving directory '/home/openwrt/openwrt/lede'
make[1]: *** [package/Makefile:110: /home/openwrt/openwrt/lede/staging_dir/target-aarch64_cortex-a53_musl/stamp/.package_compile] Error 2
make[1]: Leaving directory '/home/openwrt/openwrt/lede'
make: *** [/home/openwrt/openwrt/lede/include/toplevel.mk:230:world] 错误 2
回复

使用道具 举报

 楼主| | 显示全部楼层
zhao789110 发表于 2021-12-10 09:44
违禁软件-rust
package/Makefile:110
两个错误,先处理违禁软件。

违禁软件使用单线程编译不报错了   mbedtls这个还报错  是什么情况  大哥
回复

使用道具 举报

AnkeyVeronin 发表于 2021-12-10 09:53
违禁软件使用单线程编译不报错了   mbedtls这个还报错  是什么情况  大哥

你装哪些插件了
回复

使用道具 举报

 楼主| | 显示全部楼层

怕死沃  Adguardhome  netdata  samba4  unblockmusic

刚刚重新下了一遍DL库 还是报这个错误  应该不是文件确实问题吧
回复

使用道具 举报

AnkeyVeronin 发表于 2021-12-10 10:20
怕死沃  Adguardhome  netdata  samba4  unblockmusic

刚刚重新下了一遍DL库 还是报这个错误  应该不 ...

插件取消一个试试一个一个试,我也经常出现这种问题,只要多选择几个插件就报错,可能是插件不兼容或者是冲突了。
回复

使用道具 举报

 楼主| | 显示全部楼层
zhao789110 发表于 2021-12-10 10:30
插件取消一个试试一个一个试,我也经常出现这种问题,只要多选择几个插件就报错,可能是插件不兼容或者是 ...

好的谢谢你 我试试
回复

使用道具 举报

编译ax6s固件的时候同样出这个,搜了一下,有个回答说是arm64编译多了没必要的编译参数。
关了 Libraries->SSL->libmbedtls->Enable use of the ARMv8 Crypto Extensions 就过了。
回复

使用道具 举报

ldt511 发表于 2022-3-18 13:38
编译ax6s固件的时候同样出这个,搜了一下,有个回答说是arm64编译多了没必要的编译参数。
关了 Libraries- ...

这个问题我也遇到了,应该是cpu本身不支持硬件aes导致的?
回复

使用道具 举报

ldt511 发表于 2022-3-18 13:38
编译ax6s固件的时候同样出这个,搜了一下,有个回答说是arm64编译多了没必要的编译参数。
关了 Libraries- ...

谢谢大佬,我找了一天了,lede默认就勾选这个,编译R4S的时候一直报错
回复

使用道具 举报

buliaoyin 发表于 2022-8-21 21:30
这个问题我也遇到了,应该是cpu本身不支持硬件aes导致的?

cat /proc/cpuinfo
processor       : 0
BogoMIPS        : 25.00
Features        : fp asimd evtstrm aes pmull sha1 sha2 crc32 cpuid
CPU implementer : 0x41
CPU architecture: 8
CPU variant     : 0x0
CPU part        : 0xd03
CPU revision    : 4

CPU本身支持aes,不知道是哪的问题,我取消勾选之后也编译成功了,怀疑是跟某个插件冲突,还得再排除一下
回复

使用道具 举报

buliaoyin 发表于 2022-8-21 21:30
这个问题我也遇到了,应该是cpu本身不支持硬件aes导致的?

这个好像所有arm64 cpu编译都有这个报错。
回复

使用道具 举报

用immortalwrt-mt798x编译红米AX6000固件也是同样问题,选PW插件就不能,楼主解决了吗?
回复

使用道具 举报

您需要登录后才可以回帖 登录 | 立即注册

本版积分规则

关闭

欢迎大家光临恩山无线论坛上一条 /1 下一条

有疑问请添加管理员QQ86788181|手机版|小黑屋|Archiver|恩山无线论坛(常州市恩山计算机开发有限公司版权所有) ( 苏ICP备05084872号 )

GMT+8, 2024-5-20 04:16

Powered by Discuz! X3.5

© 2001-2024 Discuz! Team.

| 江苏省互联网有害信息举报中心 举报信箱:js12377 | @jischina.com.cn 举报电话:025-88802724 本站不良内容举报信箱:68610888@qq.com 举报电话:0519-86695797

快速回复 返回顶部 返回列表